BDBM50350534 CHEMBL404102
SMILES CCCCCCCC\C=C/CCCCCCCC(=O)c1nccs1
InChI Key InChIKey=KQKIOOAFFIIBMD-KTKRTIGZSA-N
Data  2 KI
  Tab Delimited (TSV)   2D SDfile   Computed 3D by Vconf -m prep SDfile
Find this compound or compounds like it in BindingDB:
Activity Spreadsheet -- Enzyme Inhibition Constant Data from BindingDB
Found 2 hits for monomerid = 50350534
TargetFatty-acid amide hydrolase 1 [30-579](Rattus norvegicus (rat))
Johnson & Johnson Pharmaceutical Research & Development
Curated by ChEMBL
LigandPNGBDBM50350534(CHEMBL404102)
Affinity DataKi: >1.00E+5nM. Assay description: Inhibition of rat FAAH
In DepthDetails ArticlePubMed
TargetFatty-acid amide hydrolase 1 [30-579](Rattus norvegicus (rat))
Johnson & Johnson Pharmaceutical Research & Development
Curated by ChEMBL
LigandPNGBDBM50350534(CHEMBL404102)
Affinity DataKi: >1.00E+5nM. Assay description: Inhibition of rat FAAH assessed as conversion [14]C-oleamide to oleic acid
In DepthDetails ArticlePubMed