BDBM50350552 CHEMBL1812585
SMILES CCCCCCCC\C=C/CCCCCCC(=O)C(N)=O
InChI Key InChIKey=IRAGOFPCHGZDIG-KTKRTIGZSA-N
Data  1 KI
  Tab Delimited (TSV)   2D SDfile   Computed 3D by Vconf -m prep SDfile
Find this compound or compounds like it in BindingDB:
Activity Spreadsheet -- Enzyme Inhibition Constant Data from BindingDB
Found 1 hit for monomerid = 50350552
TargetFatty-acid amide hydrolase 1(Homo sapiens (Human))
The Scripps Research Institute
Curated by ChEMBL
LigandPNGBDBM50350552(CHEMBL1812585)
Affinity DataKi:  16nM. Assay description: Inhibition of FAAH
In DepthDetails ArticlePubMed