BDBM50350947 CHEMBL1818218
SMILES CC(C)CNc1nc(ncc1C(=O)NCc1ccccc1)N1CCN(CC2CCCOC2)CC1
InChI Key InChIKey=PPANZCQXFYBGHN-UHFFFAOYSA-N
Data  1 IC50  2 EC50
  Tab Delimited (TSV)   2D SDfile   Computed 3D by Vconf -m prep SDfile
Find this compound or compounds like it in BindingDB:
Activity Spreadsheet -- Enzyme Inhibition Constant Data from BindingDB
Found 3 hits for monomerid = 50350947
LigandPNGBDBM50350947(CHEMBL1818218)
Affinity DataEC50:  23nM. Assay description: Agonist activity at human TRPA1 channel expressed in HEK293 cells assessed as calcium influx measured at every 1 second for 60 seconds by fluorescenc...
In DepthDetails ArticlePubMed
LigandPNGBDBM50350947(CHEMBL1818218)
Affinity DataEC50:  97nM. Assay description: Agonist activity at rat TRPA1 channel expressed in HEK293 cells assessed as calcium influx measured at every 1 second for 60 seconds by fluorescence ...
In DepthDetails ArticlePubMed
TargetPotassium voltage-gated channel subfamily H member 2(Homo sapiens (Human))
Pfizer
Curated by ChEMBL
LigandPNGBDBM50350947(CHEMBL1818218)
Affinity DataIC50:  580nM. Assay description: Inhibition of human ERG expressed in human HEK293 cells by patch-clamp electrophysiology
In DepthDetails ArticlePubMed