BDBM50351386 CHEMBL1819076
SMILES CCC(CC)Nc1c2CCCc2nc2c(c(C)nn12)-c1c(C)cc(OC)cc1C
InChI Key InChIKey=YFNGKGYGTYBNSY-UHFFFAOYSA-N
Data  1 IC50  1 EC50
  Tab Delimited (TSV)   2D SDfile   Computed 3D by Vconf -m prep SDfile
Find this compound or compounds like it in BindingDB:
Activity Spreadsheet -- Enzyme Inhibition Constant Data from BindingDB
Found 2 hits for monomerid = 50351386
TargetCorticotropin-releasing factor receptor 1(Homo sapiens (Human))
Minase Research Institute
Curated by ChEMBL
LigandPNGBDBM50351386(CHEMBL1819076)
Affinity DataEC50:  80nM. Assay description: Antagonist activity at human corticotropin-releasing factor receptor 1 expressed in CHO-K1 cells assessed as inhibition of CRF-induced cAMP productio...
In DepthDetails ArticlePubMed
TargetCorticotropin-releasing factor receptor 1(Homo sapiens (Human))
Minase Research Institute
Curated by ChEMBL
LigandPNGBDBM50351386(CHEMBL1819076)
Affinity DataIC50:  9nM. Assay description: Displacement of [125I]CRF from human corticotropin-releasing factor receptor 1 expressed in CHO-K1 cells after 2 hrs by gamma counting
In DepthDetails ArticlePubMed