BDBM50351501 CHEMBL1823948
SMILES Clc1ccc(cc1)C(=O)c1ccc(cc1)S(=O)(=O)c1ccc(Cl)cc1
InChI Key InChIKey=JLIKZHZECPXNKN-UHFFFAOYSA-N
Data  1 IC50
  Tab Delimited (TSV)   2D SDfile   Computed 3D by Vconf -m prep SDfile
Find this compound or compounds like it in BindingDB:
Activity Spreadsheet -- Enzyme Inhibition Constant Data from BindingDB
Found 1 hit for monomerid = 50351501
TargetAutoinducer 1 sensor kinase/phosphatase LuxN(Vibrio harveyi)
The Scripps Research Institute
Curated by ChEMBL
LigandPNGBDBM50351501(CHEMBL1823948)
Affinity DataIC50:  2.60E+3nM. Assay description: Inhibition of LuxN-dependent bioluminescence in Vibrio harveyi
In DepthDetails ArticlePubMed