BDBM50351605 CHEMBL1822773
SMILES COc1ccc(CCC(=O)NN=C2C(=O)Nc3c2c(Cl)ccc3Cl)cc1
InChI Key InChIKey=YHBNAXAFOKKMHH-UHFFFAOYSA-N
Data  1 IC50
  Tab Delimited (TSV)   2D SDfile   Computed 3D by Vconf -m prep SDfile
Find this compound or compounds like it in BindingDB:
Activity Spreadsheet -- Enzyme Inhibition Constant Data from BindingDB
Found 1 hit for monomerid = 50351605
TargetHepatocyte growth factor receptor(Homo sapiens (Human))
Sichuan University
Curated by ChEMBL
LigandPNGBDBM50351605(CHEMBL1822773)
Affinity DataIC50:  2.00E+3nM. Assay description: Inhibition of human c-MET
In DepthDetails ArticlePubMed