BDBM50351612 CHEMBL1822780
SMILES Oc1ccc(CC(=O)NN=C2C(=O)Nc3c2c(Cl)ccc3Cl)cc1Br
InChI Key InChIKey=YZNVDIYMRHUFHY-UHFFFAOYSA-N
Data  1 IC50
  Tab Delimited (TSV)   2D SDfile   Computed 3D by Vconf -m prep SDfile
Find this compound or compounds like it in BindingDB:
Activity Spreadsheet -- Enzyme Inhibition Constant Data from BindingDB
Found 1 hit for monomerid = 50351612
TargetHepatocyte growth factor receptor(Homo sapiens (Human))
Sichuan University
Curated by ChEMBL
LigandPNGBDBM50351612(CHEMBL1822780)
Affinity DataIC50:  190nM. Assay description: Inhibition of human c-MET
In DepthDetails ArticlePubMed