BDBM50351803 CHEMBL1823999
SMILES CCOC(=O)c1cn(Cc2ccc(cc2)-c2ccccc2-c2nnn[nH]2)nc1N(C(C)=O)c1ccccc1
InChI Key InChIKey=OLKCLGIIQNHVQW-UHFFFAOYSA-N
Data  1 IC50
  Tab Delimited (TSV)   2D SDfile   Computed 3D by Vconf -m prep SDfile
Find this compound or compounds like it in BindingDB:
Activity Spreadsheet -- Enzyme Inhibition Constant Data from BindingDB
Found 1 hit for monomerid = 50351803
TargetType-1 angiotensin II receptor(Homo sapiens (Human))
University Of Lille
Curated by ChEMBL
LigandPNGBDBM50351803(CHEMBL1823999)
Affinity DataIC50:  2.00E+3nM. Assay description: Displacement of [125I][Sar1,Ile8]-AT-II from human recombinant AT1 receptor expressed in HEK293 cells after 120 mins by liquid scintillation counting
In DepthDetails ArticlePubMed