BDBM50351822 CHEMBL1824442
SMILES Cc1cccc(n1)-c1nn(CC(=S)Nc2cccc(c2)C#N)cc1-c1ccc2nccnc2c1
InChI Key InChIKey=RDYDUALVZPXTDK-UHFFFAOYSA-N
Data  2 IC50
  Tab Delimited (TSV)   2D SDfile   Computed 3D by Vconf -m prep SDfile
Find this compound or compounds like it in BindingDB:
Activity Spreadsheet -- Enzyme Inhibition Constant Data from BindingDB
Found 2 hits for monomerid = 50351822
TargetTGF-beta receptor type-1(Homo sapiens (Human))
Ewha Womans University
Curated by ChEMBL
LigandPNGBDBM50351822(CHEMBL1824442)
Affinity DataIC50: >1.00E+3nM. Assay description: Inhibition of human recombinant p38alpha expressed in Escherichia coli using ATF2 as substrate by radiometric kinase assay
In DepthDetails ArticlePubMed
TargetTGF-beta receptor type-1(Homo sapiens (Human))
Ewha Womans University
Curated by ChEMBL
LigandPNGBDBM50351822(CHEMBL1824442)
Affinity DataIC50:  26nM. Assay description: Inhibition of human recombinant GST-fused ALK5 expressed in insect Sf9 cells using casein as substrate by radiometric kinase assay
In DepthDetails ArticlePubMed