BDBM50351961 CHEMBL1822213
SMILES Fc1ccc(cc1)S(=O)(=O)Nc1cc(cnc1Cl)-c1ccc2nncn2c1
InChI Key InChIKey=STJNRLBCPHBSSZ-UHFFFAOYSA-N
Data  1 KI  2 IC50
  Tab Delimited (TSV)   2D SDfile   Computed 3D by Vconf -m prep SDfile
Find this compound or compounds like it in BindingDB:
Activity Spreadsheet -- Enzyme Inhibition Constant Data from BindingDB
Found 3 hits for monomerid = 50351961
LigandPNGBDBM50351961(CHEMBL1822213)
Affinity DataKi:  51nM. Assay description: Inhibition of human PI3Kalpha using PI(4,5)P2 as substrate after 20 mins by alphascreen assay in presence of 20 uM ATP
In DepthDetails ArticlePubMed
TargetRAC-alpha serine/threonine-protein kinase(Homo sapiens (Human))
Amgen
Curated by ChEMBL
LigandPNGBDBM50351961(CHEMBL1822213)
Affinity DataIC50: >1.20E+4nM. Assay description: Inhibition of PI3K-mediated Akt phosphorylation at Ser 473 in human U87MG cells after 2 hrs by alphascreen assay
In DepthDetails ArticlePubMed
TargetSerine/threonine-protein kinase mTOR(Homo sapiens (Human))
Amgen
Curated by ChEMBL
LigandPNGBDBM50351961(CHEMBL1822213)
Affinity DataIC50: >2.50E+4nM. Assay description: Inhibition of recombinant N-terminal GST-tagged mTOR-mediated 4E-BP1 phosphorylation after 60 mins by TR-FRET assay
In DepthDetails ArticlePubMed