BDBM50352021 CHEMBL1823565
SMILES O[C@@H]1C[C@](O)(C([O-])=O)C(Cc2ccc3sccc3c2)=C(OCc2ccc3sccc3c2)[C@H]1O
InChI Key InChIKey=MGSLLSIRNDMRFT-RZTXVSJASA-M
Data  2 KI
  Tab Delimited (TSV)   2D SDfile   Computed 3D by Vconf -m prep SDfile
Find this compound or compounds like it in BindingDB:
Activity Spreadsheet -- Enzyme Inhibition Constant Data from BindingDB
Found 2 hits for monomerid = 50352021
Target3-dehydroquinate dehydratase(Helicobacter pylori)
Universidad De Santiago De Compostela
Curated by ChEMBL
LigandPNGBDBM50352021(CHEMBL1823565)
Affinity DataKi:  140nM. Assay description: Competitive inhibition of Helicobacter pylori DHQ2
In DepthDetails ArticlePubMed
Target3-dehydroquinate dehydratase(Mycobacterium tuberculosis)
Universidad De Santiago De Compostela
Curated by ChEMBL
LigandPNGBDBM50352021(CHEMBL1823565)
Affinity DataKi:  440nM. Assay description: Competitive inhibition of Mycobacterium tuberculosis DHQ2
In DepthDetails ArticlePubMed