BDBM50352455 CHEMBL1823600
SMILES COc1ccccc1NC(=O)N1CCC(CC1)c1nc(no1)-c1ccc2ccccc2c1
InChI Key InChIKey=VYMQWNORDFGDSY-UHFFFAOYSA-N
Data  1 IC50
  Tab Delimited (TSV)   2D SDfile   Computed 3D by Vconf -m prep SDfile
Find this compound or compounds like it in BindingDB:
Activity Spreadsheet -- Enzyme Inhibition Constant Data from BindingDB
Found 1 hit for monomerid = 50352455
TargetSmoothened homolog(Homo sapiens (Human))
Merck Research Laboratories
Curated by ChEMBL
LigandPNGBDBM50352455(CHEMBL1823600)
Affinity DataIC50:  2.20E+3nM. Assay description: Displacement of Bodipy-labelled cyclopamine from Smo expressed in COS-1 cells in presence of 2% FBS after 4 to 6 hrs by FACS flow cytometric analysis
In DepthDetails ArticlePubMed