BDBM50352850 CHEMBL1824335
SMILES CCn1cc(cn1)[C@]1(N=C(N)N(C)C1=O)c1cccc(c1)-c1cccnc1F
InChI Key InChIKey=IKJXVRPWMOVIMY-HXUWFJFHSA-N
Data  5 IC50  2 EC50
  Tab Delimited (TSV)   2D SDfile   Computed 3D by Vconf -m prep SDfile
Find this compound or compounds like it in BindingDB:
Activity Spreadsheet -- Enzyme Inhibition Constant Data from BindingDB
Found 7 hits for monomerid = 50352850
TargetBeta-secretase 2(Homo sapiens (Human))
Pfizer
Curated by ChEMBL
LigandPNGBDBM50352850(CHEMBL1824335)
Affinity DataIC50:  450nM. Assay description: Inhibition of BACE2 by FRET assay
In DepthDetails ArticlePubMed
TargetBeta-secretase 1(Homo sapiens (Human))
Pfizer
Curated by ChEMBL
LigandPNGBDBM50352850(CHEMBL1824335)
Affinity DataEC50:  490nM. Assay description: Inhibition of BACE1 expressed in CHO cells expressing wild type human APP assessed as inhibition of amyloid beta-40 or 42 production by ELISA assay
In DepthDetails ArticlePubMed
TargetBeta-secretase 1(Homo sapiens (Human))
Pfizer
Curated by ChEMBL
LigandPNGBDBM50352850(CHEMBL1824335)
Affinity DataEC50: >2.50E+3nM. Assay description: Inhibition of BACE1 expressed in CHO cells expressing wild type human APP assessed as inhibition of amyloid beta-40 or 42 production by ELISA assay
In DepthDetails ArticlePubMed
TargetCathepsin D(Homo sapiens (Human))
Pfizer
Curated by ChEMBL
LigandPNGBDBM50352850(CHEMBL1824335)
Affinity DataIC50:  1.30E+4nM. Assay description: Inhibition of cathepsin D by FRET assay
In DepthDetails ArticlePubMed
TargetBeta-secretase 1(Homo sapiens (Human))
Pfizer
Curated by ChEMBL
LigandPNGBDBM50352850(CHEMBL1824335)
Affinity DataIC50:  30nM. Assay description: Inhibition of BACE1 by FRET assay
In DepthDetails ArticlePubMed
TargetBeta-secretase 2(Homo sapiens (Human))
Pfizer
Curated by ChEMBL
LigandPNGBDBM50352850(CHEMBL1824335)
Affinity DataIC50:  7.39E+3nM. Assay description: Inhibition of BACE2 by FRET assay
In DepthDetails ArticlePubMed
TargetBeta-secretase 1(Homo sapiens (Human))
Pfizer
Curated by ChEMBL
LigandPNGBDBM50352850(CHEMBL1824335)
Affinity DataIC50:  1.96E+3nM. Assay description: Inhibition of BACE1 by FRET assay
In DepthDetails ArticlePubMed