BDBM50353005 CHEMBL1231666
SMILES FC(F)(F)c1ccccc1S(=O)(=O)NNC(=O)c1cc2cc(Cl)ccc2o1
InChI Key InChIKey=ZLQBZYKAQQWOTK-UHFFFAOYSA-N
Data  1 IC50
PDB links: 1 PDB ID matches this monomer.
  Tab Delimited (TSV)   2D SDfile   Computed 3D by Vconf -m prep SDfile
Find this compound or compounds like it in BindingDB:
Activity Spreadsheet -- Enzyme Inhibition Constant Data from BindingDB
Found 1 hit for monomerid = 50353005
TargetBranched-chain-amino-acid aminotransferase, cytosolic(Homo sapiens (Human))
Abbott Laboratories
Curated by ChEMBL
LigandPNGBDBM50353005(CHEMBL1231666)
Affinity DataIC50:  230nM. Assay description: Inhibition of human recombinant histidine-tagged BCATc expressed in Escherichia coli BL21 (DE3) after 50 mins using [13C]-L-leucine as substrate by N...