BDBM50353143 CHEMBL1829315
SMILES CC(C)S(=O)(=O)NC[C@H]1CC[C@@H](CC1)NC(=O)CN1CCC(C)(C)Sc2ccccc12
InChI Key InChIKey=LBCGOKCFNVYPDW-WGSAOQKQSA-N
Data  1 KI
  Tab Delimited (TSV)   2D SDfile   Computed 3D by Vconf -m prep SDfile
Find this compound or compounds like it in BindingDB:
Activity Spreadsheet -- Enzyme Inhibition Constant Data from BindingDB
Found 1 hit for monomerid = 50353143
TargetNeuropeptide Y receptor type 5(Homo sapiens (Human))
Lundbeck Research Usa
Curated by ChEMBL
LigandPNGBDBM50353143(CHEMBL1829315)
Affinity DataKi:  6.90nM. Assay description: Displacement of [125I]PYY from human NPY5 receptor expressed in thymidine kinase deficient mouse LM cells after 120 mins by scintillation counting
In DepthDetails ArticlePubMed