BDBM50353293 CHEMBL1830693
SMILES N(c1nc(cs1)-c1cn[nH]c1)c1ccccn1
InChI Key InChIKey=WIILZWDTWZFGNO-UHFFFAOYSA-N
Data  1 IC50  1 EC50
  Tab Delimited (TSV)   2D SDfile   Computed 3D by Vconf -m prep SDfile
Find this compound or compounds like it in BindingDB:
Activity Spreadsheet -- Enzyme Inhibition Constant Data from BindingDB
Found 2 hits for monomerid = 50353293
TargetMetabotropic glutamate receptor 4(Homo sapiens (Human))
Lundbeck Research Usa
Curated by ChEMBL
LigandPNGBDBM50353293(CHEMBL1830693)
Affinity DataEC50:  410nM. Assay description: Positive allosteric modulation of human mGlu4 receptor expressed in BHK cells assessed as potentiation of glutamate-induced calcium mobilization afte...
In DepthDetails ArticlePubMed
TargetPotassium voltage-gated channel subfamily H member 2(Homo sapiens (Human))
Lundbeck Research Usa
Curated by ChEMBL
LigandPNGBDBM50353293(CHEMBL1830693)
Affinity DataIC50:  3.30E+4nM. Assay description: Inhibition of human ERG
In DepthDetails ArticlePubMed