BDBM50353320 CHEMBL1830708
SMILES C1Cc2[nH]ncc2-c2nc(Nc3cccnc3)sc2C1
InChI Key InChIKey=RZBNNZQLMKBBNX-UHFFFAOYSA-N
Data  1 EC50
  Tab Delimited (TSV)   2D SDfile   Computed 3D by Vconf -m prep SDfile
Find this compound or compounds like it in BindingDB:
Activity Spreadsheet -- Enzyme Inhibition Constant Data from BindingDB
Found 1 hit for monomerid = 50353320
TargetMetabotropic glutamate receptor 4(Homo sapiens (Human))
Lundbeck Research Usa
Curated by ChEMBL
LigandPNGBDBM50353320(CHEMBL1830708)
Affinity DataEC50: >1.00E+4nM. Assay description: Positive allosteric modulation of human mGlu4 receptor expressed in BHK cells assessed as potentiation of glutamate-induced calcium mobilization afte...
In DepthDetails ArticlePubMed