BDBM50353432 CHEMBL1829876::US10196373, Compound 45O
SMILES CN(CC(=O)N(Cc1ccc(cc1)C1CCCCC1)c1ccc(C(O)=O)c(O)c1)S(=O)(=O)c1c(F)c(F)c(F)c(F)c1F
InChI Key InChIKey=WNVSFFVDMUSXSX-UHFFFAOYSA-N
Data  2 KI  6 IC50  2 Kd
  Tab Delimited (TSV)   2D SDfile   Computed 3D by Vconf -m prep SDfile
Find this compound or compounds like it in BindingDB:
Activity Spreadsheet -- Enzyme Inhibition Constant Data from BindingDB
Found 10 hits for monomerid = 50353432
TargetSignal transducer and activator of transcription 3(Homo sapiens (Human))
University Of Toronto Mississauga
Curated by ChEMBL
LigandPNGBDBM50353432(CHEMBL1829876 | US10196373, Compound 45O)
Affinity DataKi:  1.28E+4nM. Assay description: Inhibition of STAT3 using fluorescent probe 5-carboxyfluorescein-GpYLPQTV-NH2 after 15 mins by fluorescence polarisation assay
In DepthDetails ArticlePubMed
TargetSignal transducer and activator of transcription 3(Homo sapiens (Human))
University Of Toronto Mississauga
Curated by ChEMBL
LigandPNGBDBM50353432(CHEMBL1829876 | US10196373, Compound 45O)
Affinity DataKi:  1.30E+4nM. Assay description: ChIP assay was performed using EZ ChIP Kit (Millipore, Billerica, Mass., USA) as per manufacturer's instruction. Briefly, after crosslinking with...
In DepthDetails US Patent
TargetSignal transducer and activator of transcription 3(Homo sapiens (Human))
University Of Toronto Mississauga
Curated by ChEMBL
LigandPNGBDBM50353432(CHEMBL1829876 | US10196373, Compound 45O)
Affinity DataIC50:  6.80E+3nM. Assay description: Binding affinity to Stat3 (unknown origin) using hSIE as probe preincubated for 30 mins followed by hSIE addition by electrophoretic mobility shift a...
In DepthDetails ArticlePubMed
TargetSignal transducer and activator of transcription 3(Homo sapiens (Human))
University Of Toronto Mississauga
Curated by ChEMBL
LigandPNGBDBM50353432(CHEMBL1829876 | US10196373, Compound 45O)
Affinity DataKd:  500nM. Assay description: Binding affinity to full length STAT3 (unknown origin) by Surface plasmon resonance
In DepthDetails PubMed
TargetSignal transducer and activator of transcription 3(Mus musculus (mouse))
University Of Hawaii Cancer Center
Curated by ChEMBL
LigandPNGBDBM50353432(CHEMBL1829876 | US10196373, Compound 45O)
Affinity DataIC50:  6.80E+3nM. Assay description: Inhibition of STAT3 DNA binding activity in mouse NIH/3T3 nuclear extract preincubated for 30 mins followed by [32P]hSIE addition measured after 30 m...
In DepthDetails ArticlePubMed
TargetSignal transducer and activator of transcription 3(Homo sapiens (Human))
University Of Toronto Mississauga
Curated by ChEMBL
LigandPNGBDBM50353432(CHEMBL1829876 | US10196373, Compound 45O)
Affinity DataIC50:  6.80E+3nM. Assay description: Inhibition of STAT3 (unknown origin) binding to DNA by EMSA analysis
In DepthDetails PubMed
TargetSignal transducer and activator of transcription 3(Homo sapiens (Human))
University Of Toronto Mississauga
Curated by ChEMBL
LigandPNGBDBM50353432(CHEMBL1829876 | US10196373, Compound 45O)
Affinity DataKd:  4.57E+3nM. Assay description: Binding affinity to His-tagged STAT3 (127 to 722 residues) (unknown origin) incubated for 30 mins by MST assay
In DepthDetails PubMed
TargetSignal transducer and activator of transcription 3(Homo sapiens (Human))
University Of Toronto Mississauga
Curated by ChEMBL
LigandPNGBDBM50353432(CHEMBL1829876 | US10196373, Compound 45O)
Affinity DataIC50:  2.56E+4nM. Assay description: Competitive binding affinity to Stat3 SH2 domain (unknown origin) using 5-FAM-GpYLPQTV-NH2 as probe assessed as phosphopetide complex formation after...
In DepthDetails ArticlePubMed
TargetSignal transducer and activator of transcription 3(Mus musculus (mouse))
University Of Hawaii Cancer Center
Curated by ChEMBL
LigandPNGBDBM50353432(CHEMBL1829876 | US10196373, Compound 45O)
Affinity DataIC50:  1.97E+4nM. Assay description: Inhibition of STAT3 in mouse NIH3T3/vSrc nuclear extract assessed as disruption of the Stat3-DNA complex pre-incubated for 30 mins by EMSA analysis
In DepthDetails ArticlePubMed
TargetSignal transducer and activator of transcription 3(Homo sapiens (Human))
University Of Toronto Mississauga
Curated by ChEMBL
LigandPNGBDBM50353432(CHEMBL1829876 | US10196373, Compound 45O)
Affinity DataIC50:  6.80E+3nM. Assay description: ChIP assay was performed using EZ ChIP Kit (Millipore, Billerica, Mass., USA) as per manufacturer's instruction. Briefly, after crosslinking with...
In DepthDetails US Patent