BDBM50353484 CHEMBL1830587
SMILES CNC(=O)CCc1cc(-c2ccc(cc2)-c2ccc(cc2)C(F)(F)F)n(n1)-c1ccc(cc1)N1CCNCC1
InChI Key InChIKey=GHBUPSVATJKTRR-UHFFFAOYSA-N
Data  1 IC50
  Tab Delimited (TSV)   2D SDfile   Computed 3D by Vconf -m prep SDfile
Find this compound or compounds like it in BindingDB:
Activity Spreadsheet -- Enzyme Inhibition Constant Data from BindingDB
Found 1 hit for monomerid = 50353484
TargetIntegrin-linked protein kinase(Homo sapiens (Human))
The Ohio State University
Curated by ChEMBL
LigandPNGBDBM50353484(CHEMBL1830587)
Affinity DataIC50:  600nM. Assay description: Inhibition of human ILK activity assessed myelin basic protein phosphorylation by radiometric kinase assay in the presence of [gamma 32P]ATP
In DepthDetails ArticlePubMed