BDBM50353606 CHEMBL1829567
SMILES COC1Cc2c(cnn2-c2ccccc2)C2(CCNCC2)O1
InChI Key InChIKey=BJKZKUCZAUDBKE-UHFFFAOYSA-N
Data  1 KI
  Tab Delimited (TSV)   2D SDfile   Computed 3D by Vconf -m prep SDfile
Find this compound or compounds like it in BindingDB:
Activity Spreadsheet -- Enzyme Inhibition Constant Data from BindingDB
Found 1 hit for monomerid = 50353606
TargetSigma non-opioid intracellular receptor 1(Cavia porcellus (Guinea pig))
Institut F£R Pharmazeutische Und Medizinische Chemie Der Universit£T M£Nster
Curated by ChEMBL
LigandPNGBDBM50353606(CHEMBL1829567)
Affinity DataKi: >1.00E+3nM. Assay description: Displacement of (+)-[3H]pentazocine from guinea pig brain sigma 1 receptor after 180 mins by scintillation counting
In DepthDetails ArticlePubMed