BDBM50353638 CHEMBL1829805
SMILES Clc1ccc(cc1)S(=O)(=O)NCCc1cccc(CC2CC(=O)CC2=O)c1
InChI Key InChIKey=HOVQMBSPXMVMFY-UHFFFAOYSA-N
Data  2 IC50  2 Kd
  Tab Delimited (TSV)   2D SDfile   Computed 3D by Vconf -m prep SDfile
Find this compound or compounds like it in BindingDB:
Activity Spreadsheet -- Enzyme Inhibition Constant Data from BindingDB
Found 4 hits for monomerid = 50353638
TargetThromboxane A2 receptor(Homo sapiens (Human))
University Of Pennsylvania
Curated by ChEMBL
LigandPNGBDBM50353638(CHEMBL1829805)
Affinity DataKd:  203nM. Assay description: Displacement of [3H]SQ-29548 from human prostanoid TP receptor expressed in QBI-HEK 293A cells after 2 hrs by scintillation proximity assay
In DepthDetails ArticlePubMed
TargetThromboxane A2 receptor(MOUSE)
University Of Pennsylvania
Curated by ChEMBL
LigandPNGBDBM50353638(CHEMBL1829805)
Affinity DataIC50:  52nM. Assay description: Antagonist activity at mouse prostanoid TP receptor expressed in QBI-HEK 293A cells assessed as inhibition of 1-BOP-induced increase in inositol mono...
In DepthDetails ArticlePubMed
TargetThromboxane A2 receptor(Homo sapiens (Human))
University Of Pennsylvania
Curated by ChEMBL
LigandPNGBDBM50353638(CHEMBL1829805)
Affinity DataIC50:  250nM. Assay description: Antagonist activity at human prostanoid TP receptor expressed in QBI-HEK 293A cells assessed as inhibition of 1-BOP-induced increase in inositol mono...
In DepthDetails ArticlePubMed
TargetThromboxane A2 receptor(MOUSE)
University Of Pennsylvania
Curated by ChEMBL
LigandPNGBDBM50353638(CHEMBL1829805)
Affinity DataKd:  11nM. Assay description: Displacement of [3H]SQ-29548 from mouse prostanoid TP receptor expressed in QBI-HEK 293A cells after 2 hrs by scintillation proximity assay
In DepthDetails ArticlePubMed