BDBM50353653 CHEMBL1829843
SMILES OC(=O)CC(Cc1nc2ccc(cc2[nH]1)-c1ccccc1)c1ccc(Cl)cc1
InChI Key InChIKey=HLOAXXBKQYVSEQ-UHFFFAOYSA-N
Data  4 IC50
  Tab Delimited (TSV)   2D SDfile   Computed 3D by Vconf -m prep SDfile
Find this compound or compounds like it in BindingDB:
Activity Spreadsheet -- Enzyme Inhibition Constant Data from BindingDB
Found 4 hits for monomerid = 50353653
TargetProtein kinase C zeta type(Homo sapiens (Human))
Saarland University
Curated by ChEMBL
LigandPNGBDBM50353653(CHEMBL1829843)
Affinity DataIC50:  1.70E+4nM. Assay description: Inhibition of PKCzeta in human U937 cells assessed as inhibition of TNFalpha-induced NF-kB activation by luciferase reporter gene assay
In DepthDetails ArticlePubMed
TargetProtein kinase C zeta type(Homo sapiens (Human))
Saarland University
Curated by ChEMBL
LigandPNGBDBM50353653(CHEMBL1829843)
Affinity DataIC50:  2.00E+4nM. Assay description: Inhibition of human PKCzeta assessed as [gamma32P]ATP utilization using myelin basic protein as substrate
In DepthDetails ArticlePubMed
TargetProtein kinase C zeta type(Homo sapiens (Human))
Saarland University
Curated by ChEMBL
LigandPNGBDBM50353653(CHEMBL1829843)
Affinity DataIC50:  2.50E+4nM. Assay description: Inhibition of human PKCzeta assessed as [gamma32P]ATP utilization using myelin basic protein as substrate
In DepthDetails ArticlePubMed
TargetProtein kinase C zeta type(Homo sapiens (Human))
Saarland University
Curated by ChEMBL
LigandPNGBDBM50353653(CHEMBL1829843)
Affinity DataIC50:  2.50E+4nM. Assay description: Inhibition of human PKCzeta assessed as [gamma32P]ATP utilization using myelin basic protein as substrate
In DepthDetails ArticlePubMed