BDBM50353890 CHEMBL1829086::US9006187, 25
SMILES CCc1ccc(Cc2sc(cc2C)[C@@H]2O[C@H](CO)[C@@H](O)[C@H](O)[C@H]2O)cc1
InChI Key InChIKey=QACWTFAADVHMKJ-QSWMPLQWSA-N
Data  2 IC50
  Tab Delimited (TSV)   2D SDfile   Computed 3D by Vconf -m prep SDfile
Find this compound or compounds like it in BindingDB:
Activity Spreadsheet -- Enzyme Inhibition Constant Data from BindingDB
Found 2 hits for monomerid = 50353890
TargetSodium/glucose cotransporter 2(Homo sapiens (Human))
Green Cross
Curated by ChEMBL
LigandPNGBDBM50353890(CHEMBL1829086 | US9006187, 25)
Affinity DataIC50:  24.8nM. Assay description: Inhibition of human SGLT2 expressed in CHO cells assessed as [14C]-alpha-methyl-D-glucopyranoside uptake after 2 hrs by liquid scintillation counting
In DepthDetails ArticlePubMed
TargetSodium/glucose cotransporter 2(Homo sapiens (Human))
Green Cross
Curated by ChEMBL
LigandPNGBDBM50353890(CHEMBL1829086 | US9006187, 25)
Affinity DataIC50:  24.8nMpH: 7.4 T: 2°C. Assay description: For sodium-dependent glucose transport assay, cells expressing hSGLT2 were seeded into a 96-well culture plate at a density of 5x104 cells/well in RP...
In DepthDetails US Patent