BDBM50354036 CHEMBL1828890
SMILES CCCN(CCC)c1c(CC)c(Nc2ccc(OC)cc2Cl)nc2ccnn12
InChI Key InChIKey=SPPKGJMZQQTJDS-UHFFFAOYSA-N
Data  1 IC50  1 EC50
  Tab Delimited (TSV)   2D SDfile   Computed 3D by Vconf -m prep SDfile
Find this compound or compounds like it in BindingDB:
Activity Spreadsheet -- Enzyme Inhibition Constant Data from BindingDB
Found 2 hits for monomerid = 50354036
TargetCorticotropin-releasing factor receptor 1(Homo sapiens (Human))
Minase Research Institute
Curated by ChEMBL
LigandPNGBDBM50354036(CHEMBL1828890)
Affinity DataIC50:  4.20nM. Assay description: Displacement of [125I]-CRF from human CRF1 receptor expressed in CHO-K1 cells after 2 hrs by gamma counting
In DepthDetails ArticlePubMed
TargetCorticotropin-releasing factor receptor 1(Homo sapiens (Human))
Minase Research Institute
Curated by ChEMBL
LigandPNGBDBM50354036(CHEMBL1828890)
Affinity DataEC50:  8.60nM. Assay description: Antagonist activity at human CRF1 receptor expressed in CHO-K1 cells assessed as inhibition of CRF-induced cAMP accumulation after 15 mins by cAMP en...
In DepthDetails ArticlePubMed