BDBM50354179 CHEMBL1836164
SMILES COC(=O)C1(CNC(=O)c2cc(OC)cc(OC)c2)CCN(Cc2ccc(OC)cc2)CC1
InChI Key InChIKey=QVJDTMWTEMTFAP-UHFFFAOYSA-N
Data  1 IC50
  Tab Delimited (TSV)   2D SDfile   Computed 3D by Vconf -m prep SDfile
Find this compound or compounds like it in BindingDB:
Activity Spreadsheet -- Enzyme Inhibition Constant Data from BindingDB
Found 1 hit for monomerid = 50354179
TargetPotassium voltage-gated channel subfamily H member 2(Homo sapiens (Human))
Korea Institute Of Science And Technology
Curated by ChEMBL
LigandPNGBDBM50354179(CHEMBL1836164)
Affinity DataIC50:  480nM. Assay description: Inhibition of human ERG by patch clamp assay
In DepthDetails ArticlePubMed