BDBM50354351 CHEMBL1836345
SMILES OC(=O)CCN1Cc2ccc(NC(=O)c3ccc(cc3)C3CCNCC3)cc2C1=O
InChI Key InChIKey=PYELMOFQPMMHKM-UHFFFAOYSA-N
Data  2 IC50
  Tab Delimited (TSV)   2D SDfile   Computed 3D by Vconf -m prep SDfile
Find this compound or compounds like it in BindingDB:
Activity Spreadsheet -- Enzyme Inhibition Constant Data from BindingDB
Found 2 hits for monomerid = 50354351
TargetIntegrin alpha-2/beta-3(Homo sapiens (Human))
A.V. Bogatsky Physico-Chemical Institute Of The National Academy Of Sciences Of Ukraine
Curated by ChEMBL
LigandPNGBDBM50354351(CHEMBL1836345)
Affinity DataIC50:  6.80nM. Assay description: Displacement of FITC-labeled fibrinogen from alpha2beta3 in human platelets
In DepthDetails ArticlePubMed
TargetIntegrin alpha-IIb/beta-3(Homo sapiens (Human))
A.V. Bogatsky Physico-Chemical Institute Of The National Academy Of Sciences Of Ukraine
Curated by ChEMBL
LigandPNGBDBM50354351(CHEMBL1836345)
Affinity DataIC50:  6.80nM. Assay description: Inhibition of FITC-labeled fibrinogen binding to integrin alpha2bbeta3 receptor in human platelets by flow cytometry
In DepthDetails ArticlePubMed