BDBM50354356 CHEMBL1836355
SMILES OC(=O)CCNC(=O)CCNC(=O)c1ccc2CCNCc2c1
InChI Key InChIKey=DIZOQKOFMWJGAN-UHFFFAOYSA-N
Data  1 IC50
  Tab Delimited (TSV)   2D SDfile   Computed 3D by Vconf -m prep SDfile
Find this compound or compounds like it in BindingDB:
Activity Spreadsheet -- Enzyme Inhibition Constant Data from BindingDB
Found 1 hit for monomerid = 50354356
TargetIntegrin alpha-2/beta-3(Homo sapiens (Human))
A.V. Bogatsky Physico-Chemical Institute Of The National Academy Of Sciences Of Ukraine
Curated by ChEMBL
LigandPNGBDBM50354356(CHEMBL1836355)
Affinity DataIC50:  22nM. Assay description: Displacement of FITC-labeled fibrinogen from alpha2beta3 in human platelets
In DepthDetails ArticlePubMed