BDBM50354653 CHEMBL1834250
SMILES C[C@@H](N1Cc2cc(O)ccc2CC(N)C1=O)C(=O)NC1Cc2ccccc2CN(CC(N)=O)C1=O
InChI Key InChIKey=ACFTTXWQZSBVGL-OZJRSANCSA-N
Data  2 IC50
  Tab Delimited (TSV)   2D SDfile   Computed 3D by Vconf -m prep SDfile
Find this compound or compounds like it in BindingDB:
Activity Spreadsheet -- Enzyme Inhibition Constant Data from BindingDB
Found 2 hits for monomerid = 50354653
TargetMu-type opioid receptor(GUINEA PIG)
Vrije Universiteit Brussel
Curated by ChEMBL
LigandPNGBDBM50354653(CHEMBL1834250)
Affinity DataIC50:  3.60nM. Assay description: Agonist activity at guinea pig ileum Mu-type opioid receptor
In DepthDetails ArticlePubMed
TargetMu-type opioid receptor(Homo sapiens (Human))
Vrije Universiteit Brussel
Curated by ChEMBL
LigandPNGBDBM50354653(CHEMBL1834250)
Affinity DataIC50:  21nM. Assay description: Agonist activity at Mu-type opioid receptor
In DepthDetails ArticlePubMed