BDBM50355005 CHEMBL1834957
SMILES COC(=O)c1cc(CCc2ccc(cc2)S(=O)(=O)Nc2ccccn2)ccc1O
InChI Key InChIKey=UMJNQCPQYLFLJI-UHFFFAOYSA-N
Data  1 IC50
  Tab Delimited (TSV)   2D SDfile   Computed 3D by Vconf -m prep SDfile
Find this compound or compounds like it in BindingDB:
Activity Spreadsheet -- Enzyme Inhibition Constant Data from BindingDB
Found 1 hit for monomerid = 50355005
TargetCystine/glutamate transporter(Homo sapiens (Human))
Johns Hopkins University
Curated by ChEMBL
LigandPNGBDBM50355005(CHEMBL1834957)
Affinity DataIC50: >1.00E+6nM. Assay description: Inhibition of xc-cystine-glutamate antiporter-mediated cystine uptake in human U87 cells using L-[14C]cystine as substrate after 15 mins by liquid sc...
In DepthDetails ArticlePubMed