BDBM50355011 CHEMBL1834962
SMILES OC(=O)c1cc(ccc1O)C#Cc1ccccc1
InChI Key InChIKey=KMDHRTJLNUICNY-UHFFFAOYSA-N
Data  1 IC50
  Tab Delimited (TSV)   2D SDfile   Computed 3D by Vconf -m prep SDfile
Find this compound or compounds like it in BindingDB:
Activity Spreadsheet -- Enzyme Inhibition Constant Data from BindingDB
Found 1 hit for monomerid = 50355011
TargetCystine/glutamate transporter(Homo sapiens (Human))
Johns Hopkins University
Curated by ChEMBL
LigandPNGBDBM50355011(CHEMBL1834962)
Affinity DataIC50:  1.50E+5nM. Assay description: Inhibition of xc-cystine-glutamate antiporter-mediated cystine uptake in human U87 cells using L-[14C]cystine as substrate after 15 mins by liquid sc...
In DepthDetails ArticlePubMed