BDBM50355125 CHEMBL1835787
SMILES Cn1nc(-c2ccc(OCCCN3CCCCC3)cc2)c2CCCCc2c1=O
InChI Key InChIKey=FCAOLWOHALEOJU-UHFFFAOYSA-N
Data  2 KI  5 IC50
  Tab Delimited (TSV)   2D SDfile   Computed 3D by Vconf -m prep SDfile
Find this compound or compounds like it in BindingDB:
Activity Spreadsheet -- Enzyme Inhibition Constant Data from BindingDB
Found 7 hits for monomerid = 50355125
TargetHistamine H3 receptor(Homo sapiens (Human))
Cephalon
Curated by ChEMBL
LigandPNGBDBM50355125(CHEMBL1835787)
Affinity DataKi:  1.5nM. Assay description: Displacement of [3H]-NAMH from human histamine H3 receptor expressed in CHO cells
In DepthDetails ArticlePubMed
TargetHistamine H3 receptor(Rattus norvegicus (rat))
Cephalon
Curated by ChEMBL
LigandPNGBDBM50355125(CHEMBL1835787)
Affinity DataKi:  4.5nM. Assay description: Displacement of [3H]-NAMH from rat histamine H3 receptor expressed in CHO cells
In DepthDetails ArticlePubMed
TargetCytochrome P450 2C19(Homo sapiens (Human))
Cephalon
Curated by ChEMBL
LigandPNGBDBM50355125(CHEMBL1835787)
Affinity DataIC50: >3.00E+4nM. Assay description: Inhibition of CYP2C19
In DepthDetails ArticlePubMed
TargetCytochrome P450 1A2(Homo sapiens (Human))
Cephalon
Curated by ChEMBL
LigandPNGBDBM50355125(CHEMBL1835787)
Affinity DataIC50: >3.00E+4nM. Assay description: Inhibition of CYP1A2
In DepthDetails ArticlePubMed
TargetCytochrome P450 2D6(Homo sapiens (Human))
Cephalon
Curated by ChEMBL
LigandPNGBDBM50355125(CHEMBL1835787)
Affinity DataIC50: >3.00E+4nM. Assay description: Inhibition of CYP2D6
In DepthDetails ArticlePubMed
TargetCytochrome P450 3A4(Homo sapiens (Human))
Cephalon
Curated by ChEMBL
LigandPNGBDBM50355125(CHEMBL1835787)
Affinity DataIC50: >3.00E+4nM. Assay description: Inhibition of CYP3A4
In DepthDetails ArticlePubMed
TargetCytochrome P450 2C9(Homo sapiens (Human))
Cephalon
Curated by ChEMBL
LigandPNGBDBM50355125(CHEMBL1835787)
Affinity DataIC50: >3.00E+4nM. Assay description: Inhibition of CYP2C9
In DepthDetails ArticlePubMed