BDBM50355130 CHEMBL1835778
SMILES CCCn1nc(-c2ccc(OCCCN3CCC[C@H]3C)cc2)c2sccc2c1=O
InChI Key InChIKey=QJRXSMGTYOTUTA-QGZVFWFLSA-N
Data  2 KI
  Tab Delimited (TSV)   2D SDfile   Computed 3D by Vconf -m prep SDfile
Find this compound or compounds like it in BindingDB:
Activity Spreadsheet -- Enzyme Inhibition Constant Data from BindingDB
Found 2 hits for monomerid = 50355130
TargetHistamine H3 receptor(Homo sapiens (Human))
Cephalon
Curated by ChEMBL
LigandPNGBDBM50355130(CHEMBL1835778)
Affinity DataKi:  1.5nM. Assay description: Displacement of [3H]-NAMH from human histamine H3 receptor expressed in CHO cells
In DepthDetails ArticlePubMed
TargetHistamine H3 receptor(Rattus norvegicus (rat))
Cephalon
Curated by ChEMBL
LigandPNGBDBM50355130(CHEMBL1835778)
Affinity DataKi:  12nM. Assay description: Displacement of [3H]-NAMH from rat histamine H3 receptor expressed in CHO cells
In DepthDetails ArticlePubMed