BDBM50355200 CHEMBL1835528
SMILES Cc1ccc(NC(=S)n2cc(c(n2)-c2cccc(C)n2)-c2ccc3ncnn3c2)cc1
InChI Key InChIKey=IMHWIHXPHJJZTK-UHFFFAOYSA-N
Data  2 IC50
  Tab Delimited (TSV)   2D SDfile   Computed 3D by Vconf -m prep SDfile
Find this compound or compounds like it in BindingDB:
Activity Spreadsheet -- Enzyme Inhibition Constant Data from BindingDB
Found 2 hits for monomerid = 50355200
TargetTGF-beta receptor type-1(Homo sapiens (Human))
Ewha Womans University
Curated by ChEMBL
LigandPNGBDBM50355200(CHEMBL1835528)
Affinity DataIC50:  6.61nM. Assay description: Inhibition of human recombinant GST-fused ALK5 expressed in Sf9 cells using casein as a substrate by radioisotopic protein kinase assay
In DepthDetails ArticlePubMed
TargetTGF-beta receptor type-1(Homo sapiens (Human))
Ewha Womans University
Curated by ChEMBL
LigandPNGBDBM50355200(CHEMBL1835528)
Affinity DataIC50:  2.96E+3nM. Assay description: Inhibition of human recombinant p38alpha expressed in Escherichia coli using ATF2 as a substrate by radioisotopic protein kinase assay
In DepthDetails ArticlePubMed