BDBM50355278 CHEMBL1834792
SMILES FC(F)(F)c1ccc2[nH]nc(NCC(=O)NC3CN(C3)[C@H]3CC[C@H](CC3)c3cncs3)c2c1
InChI Key InChIKey=VIVZXPJCCFWJDH-AKAXFMLLSA-N
Data  3 IC50
  Tab Delimited (TSV)   2D SDfile   Computed 3D by Vconf -m prep SDfile
Find this compound or compounds like it in BindingDB:
Activity Spreadsheet -- Enzyme Inhibition Constant Data from BindingDB
Found 3 hits for monomerid = 50355278
TargetC-C chemokine receptor type 2(Homo sapiens (Human))
Johnson & Johnson Pharmaceutical Research And Development
Curated by ChEMBL
LigandPNGBDBM50355278(CHEMBL1834792)
Affinity DataIC50:  16nM. Assay description: Displacement of [125I]-MCP1 from human CCR2 receptor in THP1 cells after 2 hrs by scintillation counting
In DepthDetails ArticlePubMed
TargetPotassium voltage-gated channel subfamily H member 2(Homo sapiens (Human))
Johnson & Johnson Pharmaceutical Research And Development
Curated by ChEMBL
LigandPNGBDBM50355278(CHEMBL1834792)
Affinity DataIC50: >5.00E+4nM. Assay description: Displacement of [3H]-astemizole from human ERG in HEK293 cells after 1 hrs by scintillation counting
In DepthDetails ArticlePubMed
TargetC-C chemokine receptor type 2(Homo sapiens (Human))
Johnson & Johnson Pharmaceutical Research And Development
Curated by ChEMBL
LigandPNGBDBM50355278(CHEMBL1834792)
Affinity DataIC50:  11nM. Assay description: Antagonist activity at human CCR2 receptor in THP1 cells assessed as inhibition of MCP1-induced chemotaxis after 3 hrs
In DepthDetails ArticlePubMed