BDBM50355319 CHEMBL1835223
SMILES COc1ccc2oc(=O)c(cc2c1)-c1cccc(C)c1
InChI Key InChIKey=QPPLXIMUBLSEBJ-UHFFFAOYSA-N
Data  1 IC50
  Tab Delimited (TSV)   2D SDfile   Computed 3D by Vconf -m prep SDfile
Find this compound or compounds like it in BindingDB:
Activity Spreadsheet -- Enzyme Inhibition Constant Data from BindingDB
Found 1 hit for monomerid = 50355319
TargetAmine oxidase [flavin-containing] B(Homo sapiens (Human))
University Of Santiago De Compostela
Curated by ChEMBL
LigandPNGBDBM50355319(CHEMBL1835223)
Affinity DataIC50:  17.1nM. Assay description: Inhibition of human recombinant MAO-B expressed in insect BT1-TN-5B1-4 cells assessed as production of hydrogen peroxide from p-tyramine up to 15 min...
In DepthDetails ArticlePubMed