BDBM50355350 CHEMBL1835417
SMILES N[C@@H](Cc1ccccc1)C(=O)N1CC2(C[C@H]1C(=O)NCCCCCC(=O)NO)SCCS2
InChI Key InChIKey=XFXNOERGJPXACU-ROUUACIJSA-N
Data  1 IC50
  Tab Delimited (TSV)   2D SDfile   Computed 3D by Vconf -m prep SDfile
Find this compound or compounds like it in BindingDB:
Activity Spreadsheet -- Enzyme Inhibition Constant Data from BindingDB
Found 1 hit for monomerid = 50355350
TargetHistone deacetylase 8(Homo sapiens (Human))
Shandong University
Curated by ChEMBL
LigandPNGBDBM50355350(CHEMBL1835417)
Affinity DataIC50:  840nM. Assay description: Inhibition of human HDAC8 expressed in Escherichia coli using Boc-Lys (acetyl)-AMC as substrate treated for 5 mins before substrate addition measured...
In DepthDetails ArticlePubMed