BDBM50355490 CHEMBL1835869
SMILES CC(=O)N1CCC(C1)c1ccc(Nc2nc(N)n(n2)-c2ccccn2)cc1
InChI Key InChIKey=OEVGYUXYZSTGNX-UHFFFAOYSA-N
Data  1 KI
  Tab Delimited (TSV)   2D SDfile   Computed 3D by Vconf -m prep SDfile
Find this compound or compounds like it in BindingDB:
Activity Spreadsheet -- Enzyme Inhibition Constant Data from BindingDB
Found 1 hit for monomerid = 50355490
TargetReceptor-type tyrosine-protein kinase FLT3(Homo sapiens (Human))
Vertex Pharmaceuticals
Curated by ChEMBL
LigandPNGBDBM50355490(CHEMBL1835869)
Affinity DataKi:  5nM. Assay description: Displacement of [33P]ATP from human recombinant FLT3 domain after 20 mins by scintillation counting
In DepthDetails ArticlePubMed