BDBM50355553 CHEMBL1910607
SMILES NC(=N)N\N=C/c1c(nc2sc(F)cn12)-c1ccc(cc1)[N+]([O-])=O
InChI Key InChIKey=CMMCZZCNNANQIV-ZWSORDCHSA-N
Data  3 IC50
  Tab Delimited (TSV)   2D SDfile   Computed 3D by Vconf -m prep SDfile
Find this compound or compounds like it in BindingDB:
Activity Spreadsheet -- Enzyme Inhibition Constant Data from BindingDB
Found 3 hits for monomerid = 50355553
TargetSerine/threonine-protein kinase Chk1(Homo sapiens (Human))
Universit£
Curated by ChEMBL
LigandPNGBDBM50355553(CHEMBL1910607)
Affinity DataIC50: >1.00E+5nM. Assay description: Inhibition of CHK1 assessed as inhibition of substrate phosphorylation using fluorescent peptide substrate by microplate reader assay
In DepthDetails ArticlePubMed
TargetSerine/threonine-protein kinase Chk2(Homo sapiens (Human))
Universit£
Curated by ChEMBL
LigandPNGBDBM50355553(CHEMBL1910607)
Affinity DataIC50:  5.65E+4nM. Assay description: Inhibition of CHK2 assessed as inhibition of substrate phosphorylation using fluorescent peptide substrate by microplate reader assay
In DepthDetails ArticlePubMed
TargetRibosomal protein S6 kinase alpha-3(Homo sapiens (Human))
Universit£
Curated by ChEMBL
LigandPNGBDBM50355553(CHEMBL1910607)
Affinity DataIC50:  2.15E+3nM. Assay description: Inhibition of RSK2 assessed as inhibition of substrate phosphorylation using fluorescent peptide substrate by microplate reader assay
In DepthDetails ArticlePubMed