BDBM50355563 CHEMBL1910631
SMILES Cc1cn2c(\C=N\NC(N)=N)c(nc2s1)-c1ccc(Cl)c(c1)[N+]([O-])=O
InChI Key InChIKey=UZGUZZAJIKMRJR-BLLMUTORSA-N
Data  3 IC50
  Tab Delimited (TSV)   2D SDfile   Computed 3D by Vconf -m prep SDfile
Find this compound or compounds like it in BindingDB:
Activity Spreadsheet -- Enzyme Inhibition Constant Data from BindingDB
Found 3 hits for monomerid = 50355563
TargetSerine/threonine-protein kinase Chk1(Homo sapiens (Human))
Universit£
Curated by ChEMBL
LigandPNGBDBM50355563(CHEMBL1910631)
Affinity DataIC50: >1.00E+5nM. Assay description: Inhibition of CHK1 assessed as inhibition of substrate phosphorylation using fluorescent peptide substrate by microplate reader assay
In DepthDetails ArticlePubMed
TargetSerine/threonine-protein kinase Chk2(Homo sapiens (Human))
Universit£
Curated by ChEMBL
LigandPNGBDBM50355563(CHEMBL1910631)
Affinity DataIC50:  6.48E+4nM. Assay description: Inhibition of CHK2 assessed as inhibition of substrate phosphorylation using fluorescent peptide substrate by microplate reader assay
In DepthDetails ArticlePubMed
TargetRibosomal protein S6 kinase alpha-3(Homo sapiens (Human))
Universit£
Curated by ChEMBL
LigandPNGBDBM50355563(CHEMBL1910631)
Affinity DataIC50:  3.76E+3nM. Assay description: Inhibition of RSK2 assessed as inhibition of substrate phosphorylation using fluorescent peptide substrate by microplate reader assay
In DepthDetails ArticlePubMed