BDBM50355742 CHEMBL1911273
SMILES CCN(C)C(=O)c1ccc(cc1)-c1ccc2[C@@H](c3ccccc3Oc2n1)C(C)(C)C(=O)Nc1nncs1
InChI Key InChIKey=YNNPNQRIGVPPSM-HSZRJFAPSA-N
Data  1 KI  5 EC50
  Tab Delimited (TSV)   2D SDfile   Computed 3D by Vconf -m prep SDfile
Find this compound or compounds like it in BindingDB:
Activity Spreadsheet -- Enzyme Inhibition Constant Data from BindingDB
Found 6 hits for monomerid = 50355742
TargetGlucocorticoid receptor(Homo sapiens (Human))
Bristol-Myers Squibb
Curated by ChEMBL
LigandPNGBDBM50355742(CHEMBL1911273)
Affinity DataKi:  0.670nM. Assay description: Displacement of GS-red from glucocorticoid receptor by fluorescence polarization assay
In DepthDetails ArticlePubMed
TargetGlucocorticoid receptor(Homo sapiens (Human))
Bristol-Myers Squibb
Curated by ChEMBL
LigandPNGBDBM50355742(CHEMBL1911273)
Affinity DataEC50:  7.80nM. Assay description: Transrepression activity at glucocorticoid receptor alpha in IL-1beta-stimulated human A549 cells assessed as inhibition of NFkappaB-dependent E-sele...
In DepthDetails ArticlePubMed
TargetGlucocorticoid receptor(Homo sapiens (Human))
Bristol-Myers Squibb
Curated by ChEMBL
LigandPNGBDBM50355742(CHEMBL1911273)
Affinity DataEC50:  740nM. Assay description: Transactivation activity at glucocorticoid receptor alpha human 13D3/Huh7 cells assessed as induction of TAT activity after 4 hrs by spectrophotometr...
In DepthDetails ArticlePubMed
TargetGlucocorticoid receptor(Homo sapiens (Human))
Bristol-Myers Squibb
Curated by ChEMBL
LigandPNGBDBM50355742(CHEMBL1911273)
Affinity DataEC50:  36.7nM. Assay description: Transactivation activity at GR-alpha in human NP1 Hela cells assessed as inhibition of GAL4-DBD after 20 hrs by luciferase reporter gene assay
In DepthDetails ArticlePubMed
TargetGlucocorticoid receptor(Homo sapiens (Human))
Bristol-Myers Squibb
Curated by ChEMBL
LigandPNGBDBM50355742(CHEMBL1911273)
Affinity DataEC50:  32.4nM. Assay description: Transactivation activity at GR-alpha in human NP1 Hela cells assessed as induction of GAL4-DBD after 20 hrs by luciferase reporter gene assay
In DepthDetails ArticlePubMed
TargetGlucocorticoid receptor(Homo sapiens (Human))
Bristol-Myers Squibb
Curated by ChEMBL
LigandPNGBDBM50355742(CHEMBL1911273)
Affinity DataEC50:  17.4nM. Assay description: Transrepression activity at glucocorticoid receptor alpha in phorbol myristate acetate-stimulated human A549 cells assessed as inhibition of AP1 resp...
In DepthDetails ArticlePubMed