BDBM50355768 CHEMBL1911607
SMILES COc1ccc(cc1)N(C)C(=O)Cn1n(-c2ccccc2)c(=O)c2c(C)c3ccccc3nc12
InChI Key InChIKey=OCIFFDWRYLLNAF-UHFFFAOYSA-N
Data  1 IC50
  Tab Delimited (TSV)   2D SDfile   Computed 3D by Vconf -m prep SDfile
Find this compound or compounds like it in BindingDB:
Activity Spreadsheet -- Enzyme Inhibition Constant Data from BindingDB
Found 1 hit for monomerid = 50355768
TargetTranslocator protein(Rattus norvegicus (rat))
Universit£
Curated by ChEMBL
LigandPNGBDBM50355768(CHEMBL1911607)
Affinity DataIC50:  17nM. Assay description: Displacement of [3H]PK11195 from TSPO in Sprague-Dawley rat brain homogenates after 90 mins by liquid scintillation spectrometry
In DepthDetails ArticlePubMed