BDBM50355804 CHEMBL1911749
SMILES C[C@@H]1COc2ccc(OC(F)(F)F)cc2[C@H](C)N1C(=O)c1ccc(Cl)cc1
InChI Key InChIKey=ZJGXKDOWNYGOPT-NEPJUHHUSA-N
Data  1 IC50
  Tab Delimited (TSV)   2D SDfile   Computed 3D by Vconf -m prep SDfile
Find this compound or compounds like it in BindingDB:
Activity Spreadsheet -- Enzyme Inhibition Constant Data from BindingDB
Found 1 hit for monomerid = 50355804
TargetOrexin receptor type 2(Homo sapiens (Human))
Takeda Pharmaceutical
Curated by ChEMBL
LigandPNGBDBM50355804(CHEMBL1911749)
Affinity DataIC50:  140nM. Assay description: Antagonist activity at human OX2R expressed in CHO cells assessed intracellular calcium mobilization by FLIPR assay
In DepthDetails ArticlePubMed