BDBM50355811 CHEMBL4170582
SMILES [H][C@@]12CC[C@H](c3ccc4cnccc4c3)[C@@]1(C)CC[C@@]1([H])[C@@]2([H])CC=C2C[C@@H](O)CC[C@]12C
InChI Key InChIKey=ADODHVVCFHLOHD-RWPYVKSISA-N
Data  1 IC50
  Tab Delimited (TSV)   2D SDfile   Computed 3D by Vconf -m prep SDfile
Find this compound or compounds like it in BindingDB:
Activity Spreadsheet -- Enzyme Inhibition Constant Data from BindingDB
Found 1 hit for monomerid = 50355811
TargetCyclin-dependent kinase 8(Homo sapiens (Human))
Dana-Farber Cancer Institute
Curated by ChEMBL
LigandPNGBDBM50355811(CHEMBL4170582)
Affinity DataIC50:  6.00E+3nM. Assay description: Inhibition of CDK8 (unknown origin)
In DepthDetails ArticlePubMed