BDBM50356257 CHEMBL1910688
SMILES C\N=C1/S\C(=C/c2cc(C)n(Cc3ccccc3F)c2C)C(=O)N1C
InChI Key InChIKey=CBCXZCNKPLLTKW-HDRGVUIASA-N
Data  3 EC50
  Tab Delimited (TSV)   2D SDfile   Computed 3D by Vconf -m prep SDfile
Find this compound or compounds like it in BindingDB:
Activity Spreadsheet -- Enzyme Inhibition Constant Data from BindingDB
Found 3 hits for monomerid = 50356257
TargetSphingosine 1-phosphate receptor 4(Homo sapiens (Human))
The Scripps Research Institute
Curated by ChEMBL
LigandPNGBDBM50356257(CHEMBL1910688)
Affinity DataEC50:  72nM. Assay description: Agonist activity at S1P4 receptor in human U2OS cells expressing VP16-GAL4 transcriptional factor and beta-arrestin/TEV protease fusion protein asses...
In DepthDetails ArticlePubMed
TargetSphingosine 1-phosphate receptor 5(Homo sapiens (Human))
The Scripps Research Institute
Curated by ChEMBL
LigandPNGBDBM50356257(CHEMBL1910688)
Affinity DataEC50:  51nM. Assay description: Agonist activity at S1P5 receptor
In DepthDetails ArticlePubMed
TargetSphingosine 1-phosphate receptor 1(Homo sapiens (Human))
The Scripps Research Institute
Curated by ChEMBL
LigandPNGBDBM50356257(CHEMBL1910688)
Affinity DataEC50:  250nM. Assay description: Agonist activity at S1P1 receptor
In DepthDetails ArticlePubMed