BDBM50356301 CHEMBL1911237
SMILES CC1CCCCN1CC(=O)Nc1ccc(cc1)S(=O)(=O)NC(N)=N
InChI Key InChIKey=FQWCRLSEOQSMRN-UHFFFAOYSA-N
Data  1 IC50
  Tab Delimited (TSV)   2D SDfile   Computed 3D by Vconf -m prep SDfile
Find this compound or compounds like it in BindingDB:
Activity Spreadsheet -- Enzyme Inhibition Constant Data from BindingDB
Found 1 hit for monomerid = 50356301
TargetAcrosin(Homo sapiens (Human))
Second Military Medical University
Curated by ChEMBL
LigandPNGBDBM50356301(CHEMBL1911237)
Affinity DataIC50:  9.90E+6nM. Assay description: Inhibition of acrosin activity in human spermatozoa using N-alpha-benzoyl-DL-arginine para-nitroanilide-HCI as a substrate after 3 hrs by spectrophot...
In DepthDetails ArticlePubMed