BDBM50356495 CHEMBL1912004
SMILES C(CNCc1ccc2OCOc2c1)CN(Cc1ccc2occc2c1)c1nc(ns1)-n1ccnc1
InChI Key InChIKey=OPZUSPWPWXFPQX-UHFFFAOYSA-N
Data  3 EC50
  Tab Delimited (TSV)   2D SDfile   Computed 3D by Vconf -m prep SDfile
Find this compound or compounds like it in BindingDB:
Activity Spreadsheet -- Enzyme Inhibition Constant Data from BindingDB
Found 3 hits for monomerid = 50356495
TargetNitric oxide synthase, inducible(Homo sapiens (Human))
Kalypsys
Curated by ChEMBL
LigandPNGBDBM50356495(CHEMBL1912004)
Affinity DataEC50:  90nM. Assay description: Inhibition of human iNOS expressed in human HEK293 cells assessed as nitrite accumulation after 18 hrs by 2,3-diaminonapthalene assay
In DepthDetails ArticlePubMed
TargetNitric oxide synthase, endothelial(Homo sapiens (Human))
Kalypsys
Curated by ChEMBL
LigandPNGBDBM50356495(CHEMBL1912004)
Affinity DataEC50: >1.00E+5nM. Assay description: Inhibition of human eNOS expressed in HEK293 cells assessed as inhibition A23187-induced nitric oxide production incubated for 24 hrs measured after ...
In DepthDetails ArticlePubMed
TargetNitric oxide synthase, brain(Homo sapiens (Human))
Kalypsys
Curated by ChEMBL
LigandPNGBDBM50356495(CHEMBL1912004)
Affinity DataEC50:  7.90E+3nM. Assay description: Inhibition of human nNOS expressed in HEK293 cells assessed as inhibition ionomycin-induced nitric oxide production incubated for 24 hrs measured aft...
In DepthDetails ArticlePubMed