BDBM50356745 CHEMBL1917798
SMILES CCCS(=O)(=O)c1cccc(c1)C#Cc1c(OCC(O)=O)cccc1-c1ccccc1
InChI Key InChIKey=PPNULZYRSSLFSN-UHFFFAOYSA-N
Data  1 KI
  Tab Delimited (TSV)   2D SDfile   Computed 3D by Vconf -m prep SDfile
Find this compound or compounds like it in BindingDB:
Activity Spreadsheet -- Enzyme Inhibition Constant Data from BindingDB
Found 1 hit for monomerid = 50356745
TargetProstaglandin D2 receptor 2(Homo sapiens (Human))
Merck Serono
Curated by ChEMBL
LigandPNGBDBM50356745(CHEMBL1917798)
Affinity DataKi:  19nM. Assay description: Displacement of [3H]PGD2 from human CRTH2 expressed in chinese hamster CHO cells by liquid scintillation counting
In DepthDetails ArticlePubMed