BDBM50356851 CHEMBL1915040
SMILES Nc1nc(N2C[C@@H]3C[C@H]2CN3)c2sc3ccc(Cl)cc3c2n1
InChI Key InChIKey=IMKRDBMFBBIVHV-IUCAKERBSA-N
Data  1 KI
  Tab Delimited (TSV)   2D SDfile   Computed 3D by Vconf -m prep SDfile
Find this compound or compounds like it in BindingDB:
Activity Spreadsheet -- Enzyme Inhibition Constant Data from BindingDB
Found 1 hit for monomerid = 50356851
TargetHistamine H4 receptor(Homo sapiens (Human))
Johnson & Johnson Pharmaceutical Research & Development
Curated by ChEMBL
LigandPNGBDBM50356851(CHEMBL1915040)
Affinity DataKi:  837nM. Assay description: Displacement of [3H]histamine from recombinant human histamine H4 receptor
In DepthDetails ArticlePubMed