BDBM50357022 CHEMBL1916646
SMILES CC(C)[C@@H](N(CCc1ccccc1)S(=O)(=O)c1ccc2ccccc2c1)C(=O)NO
InChI Key InChIKey=ZHMDSAFJPANUBJ-JOCHJYFZSA-N
Data  2 IC50
  Tab Delimited (TSV)   2D SDfile   Computed 3D by Vconf -m prep SDfile
Find this compound or compounds like it in BindingDB:
Activity Spreadsheet -- Enzyme Inhibition Constant Data from BindingDB
Found 2 hits for monomerid = 50357022
Target72 kDa type IV collagenase(Homo sapiens (Human))
Novartis Institutes For Biomedical Research
Curated by ChEMBL
LigandPNGBDBM50357022(CHEMBL1916646)
Affinity DataIC50:  200nM. Assay description: Inhibition of MMP2
In DepthDetails ArticlePubMed
TargetCollagenase 3(Homo sapiens (Human))
Novartis Institutes For Biomedical Research
Curated by ChEMBL
LigandPNGBDBM50357022(CHEMBL1916646)
Affinity DataIC50:  2nM. Assay description: Inhibition of MMP13
In DepthDetails ArticlePubMed