BDBM50357069 CHEMBL1914487
SMILES Oc1ccc2OC[C@@H](Oc2c1)[C@@H]1CCCN1
InChI Key InChIKey=DAEZAXIEKCUESJ-JOYOIKCWSA-N
Data  1 KI
  Tab Delimited (TSV)   2D SDfile   Computed 3D by Vconf -m prep SDfile
Find this compound or compounds like it in BindingDB:
Activity Spreadsheet -- Enzyme Inhibition Constant Data from BindingDB
Found 1 hit for monomerid = 50357069
TargetNeuronal acetylcholine receptor subunit alpha-7(Rattus norvegicus (Rat))
Universit£
Curated by ChEMBL
LigandPNGBDBM50357069(CHEMBL1914487)
Affinity DataKi:  5.30E+4nM. Assay description: Displacement of [125I]alpha-bungarotoxin from alpha7 nAChR in Sprague-Dawley rat cerebral cortex by beta counting
In DepthDetails ArticlePubMed